Vídeos em Destaque
Pesquisas Populares
Vistos Recentemente
Estados de Espírito e Géneros
Autumn
Chill
Commute
Energize
Feel good
Focus
Gaming
Party
Romance
Sad
Sleep
Summer
Winter
Workout
African
Arabic
Blues
Bollywood & Indian
Classical
Country & Americana
Dance & electronic
Decades
Family
Folk & acoustic
German hip-hop
German pop
Hip-hop
Indie & alternative
J-Pop
Jazz
K-Pop
Latin
Mandopop & cantopop
Metal
Pop
R&B & soul
Reggae & caribbean
Rock
Schlager
Soundtracks & musicals
A Minha Conta
Iniciar Sessão
As Minhas Listas de Reprodução
As Minhas Estatísticas
Carregar
Blog
PT
English
Español
Français
Bahasa Indonesia
Português
Türkçe
Compilation errors in cordova
5:30
|
A processar vídeo...
A Carregar...
Transferir
Vídeo Seguinte
Fix Cordova Android Build Error: transformClassesWithDexForDebug FAILED
3:33
|
Vídeos Relacionados
3:33
Fix Cordova Android Build Error: transformClassesWithDexForDebug FAILED
1:49
Compile error for cordova google maps sdk
3:43
cordova encountered an error. you may get more insight
1:51
Resolve the Android SDK Directory Issue in Cordova When Creating Packages
3:15
HOW TO SOLVE CORDOVA HTTP Error on Android 9 &10
2:04
Error: cordovaProject projectConfig getFileResources is not a function
1:18
NodeJS : Cordova compile error
1:37
How to Fix No SDK Build Tools Installed Error in Cordova for Android on Mac
1:40
Solving the Cordova Build Failed: Deprecated Gradle Issue for Android Development
1:04
How to Fix 'undefined method `map' for nil:NilClass' Error in Cordova iOS Update
1:41
Android : Cordova android build fails immediately [Error: spawn EACCES]
1:41
Resolving the Cordova Build Failed with aapt2 Unknown Chunk Type '200' Issue
0:37
Fix Cordova Signed APK Build Issues Fast | short Tutorial
1:44
How to Fix the Cordova Error When Adding iOS Platform with cordova-plugin-firebasex
1:31
Fixing Cordova Error: Multiple Dex Files Define Lcom/google/android/gms/iid/zzc
1:12
cordova error: AAPT: error: resource android:attr/lStar not found.(Solved) Monaca
3:51
How to Fix Ionic APK Build Error - Execution Faild for Task app:transformClassesWithDesugarForDebug
0:50
Easy Fix for Build Tools Revision is Curropted - Cordova Run Android
1:25
Android : Error when running cordova build –release android